{"text_format":"1","workbook":"xlsx","n_sheets":11,"sheets":["Secondary Values Report","A (Acute)","B (Acute-Optional)","C (Acute)","SAF (2D)","Acute-acceptiblity requirements","D (Chronic)","E (Chronic-Optional)","F (Chronic)","Chronic-acceptiblity requiremen","Tab Descriptions"],"not_rendered":{"charts":0,"images":1,"macros":1,"external_links":0,"defined_names":0,"comments":6,"pivot_tables":0},"unopened":[],"bounds":{"document_bytes":16777216,"sheet_cells":100000,"rows_first":2000,"rows_last":500,"rows_between":2000,"halvings":0,"cell_chars":16384,"cell_head_chars":4096},"cells_cut":0,"cells_raw":0,"read":"whole","date_system":"1900"}

{"sheet":"Secondary Values Report","index":0,"n_rows":34,"n_cols":6,"rows_kept":34,"cut":false,"hidden":false,"merged":[[25,1,25,4],[30,1,30,4],[6,1,6,4],[5,1,5,4],[26,1,26,4],[24,1,24,4],[23,1,23,4],[26,0,27,0],[28,0,29,0],[27,1,27,4],[28,1,28,4],[29,1,29,4],[0,0,0,4],[4,2,4,4],[14,0,14,4],[22,0,22,4],[8,1,8,2],[7,1,7,2],[1,1,1,4],[12,1,12,4],[11,1,11,2],[10,1,10,2],[9,1,9,2],[3,1,3,4],[17,0,18,0],[19,0,20,0],[2,1,2,4]]}
["General Information"]
["WDNR Staff Completing Review Name:"]
["WDNR Staff Email:"]
["Facility Name                 (Wastewater staff):"]
["WPDES Permit Number                 (if applicable):","WI-"]
["Product Trade Name:"]
["Product Manufacturer:"]
["Active Ingredients:","Ingredient Name*",null,"CAS Number*","%wt or %vol*"]
[]
[]
{"$rows_left_out":25}
{"sheet":"A (Acute)","index":1,"n_rows":44,"n_cols":12,"rows_kept":44,"cut":false,"hidden":false,"merged":[[0,3,1,3],[0,2,1,2],[0,1,1,1],[0,0,1,0],[0,5,0,6],[0,11,1,11],[0,9,1,9],[0,8,1,8],[0,7,1,7],[0,4,1,4],[0,10,1,10],[14,2,16,2],[14,3,16,3],[29,0,34,0],[29,1,31,1],[29,2,31,2],[29,3,31,3],[32,1,34,1],[32,2,34,2],[32,3,34,3],[23,0,28,0],[23,1,25,1],[23,2,25,2],[23,3,25,3],[26,1,28,1],[26,2,28,2],[26,3,28,3],[2,0,22,0],[2,1,10,1],[2,2,4,2],[2,3,4,3],[5,2,7,2],[5,3,7,3],[8,2,10,2],[8,3,10,3],[17,1,22,1],[17,2,19,2],[17,3,19,3],[20,2,22,2],[20,3,22,3],[11,1,16,1],[11,2,13,2],[11,3,13,3]]}
["Taxa Category","Genus","Species","Common Name","Test Duration & Endpoint","Toxicity Test Result",null,"Test Method","Exposure Format","Control Response","Toxicity Value (mg/L)","Acceptable?"]
[null,null,null,null,null," Value","Units"]
["Planktonic Crustacean","Ceriodaphnia","dubia","Cladoceran (water flea)",null,null,null,null,null,null,{"$f":"IF(L3=\"No\",\"\",IF(G3=\"mg/L (ppm)\",F3,(IF(G3=\"µg/L (ppb)\",F3/1000,(IF(G3=\"g/L\",F3*1000,\"\"))))))","v":""},{"$f":"IF(AND(E3=\"\",H3=\"\",I3=\"\",J3=\"\"),\"N/A\",(IF(OR(E3=\"\",E3=\"Other\",H3=\"\",I3=\"\",J3=\"Other\",J3=\"\",(AND(H3=\"Other\",'B (Acute-Optional)'!$B$11=\"No\"))),\"No\",\"Yes\")))","v":"N/A"}]
[null,null,null,null,null,null,null,null,null,null,"",{"$f":"IF(AND(E4=\"\",H4=\"\",I4=\"\",J4=\"\"),\"N/A\",(IF(OR(E4=\"\",E4=\"Other\",H4=\"\",I4=\"\",J4=\"Other\",J4=\"\",(AND(H4=\"Other\",'B (Acute-Optional)'!$B$11=\"No\"))),\"No\",\"Yes\")))","v":"N/A"}]
[null,null,null,null,null,null,null,null,null,null,"",{"$f":"IF(AND(E5=\"\",H5=\"\",I5=\"\",J5=\"\"),\"N/A\",(IF(OR(E5=\"\",E5=\"Other\",H5=\"\",I5=\"\",J5=\"Other\",J5=\"\",(AND(H5=\"Other\",'B (Acute-Optional)'!$B$11=\"No\"))),\"No\",\"Yes\")))","v":"N/A"}]
[null,null,"reticulata","Water flea",null,null,null,null,null,null,"",{"$f":"IF(AND(E6=\"\",H6=\"\",I6=\"\",J6=\"\"),\"N/A\",(IF(OR(E6=\"\",E6=\"Other\",H6=\"\",I6=\"\",J6=\"Other\",J6=\"\",(AND(H6=\"Other\",'B (Acute-Optional)'!$B$11=\"No\"))),\"No\",\"Yes\")))","v":"N/A"}]
[null,null,null,null,null,null,null,null,null,null,"",{"$f":"IF(AND(E7=\"\",H7=\"\",I7=\"\",J7=\"\"),\"N/A\",(IF(OR(E7=\"\",E7=\"Other\",H7=\"\",I7=\"\",J7=\"Other\",J7=\"\",(AND(H7=\"Other\",'B (Acute-Optional)'!$B$11=\"No\"))),\"No\",\"Yes\")))","v":"N/A"}]
[null,null,null,null,null,null,null,null,null,null,"",{"$f":"IF(AND(E8=\"\",H8=\"\",I8=\"\",J8=\"\"),\"N/A\",(IF(OR(E8=\"\",E8=\"Other\",H8=\"\",I8=\"\",J8=\"Other\",J8=\"\",(AND(H8=\"Other\",'B (Acute-Optional)'!$B$11=\"No\"))),\"No\",\"Yes\")))","v":"N/A"}]
[null,null,"serrulatus","Water flea",null,null,null,null,null,null,"",{"$f":"IF(AND(E9=\"\",H9=\"\",I9=\"\",J9=\"\"),\"N/A\",(IF(OR(E9=\"\",E9=\"Other\",H9=\"\",I9=\"\",J9=\"Other\",J9=\"\",(AND(H9=\"Other\",'B (Acute-Optional)'!$B$11=\"No\"))),\"No\",\"Yes\")))","v":"N/A"}]
[null,null,null,null,null,null,null,null,null,null,"",{"$f":"IF(AND(E10=\"\",H10=\"\",I10=\"\",J10=\"\"),\"N/A\",(IF(OR(E10=\"\",E10=\"Other\",H10=\"\",I10=\"\",J10=\"Other\",J10=\"\",(AND(H10=\"Other\",'B (Acute-Optional)'!$B$11=\"No\"))),\"No\",\"Yes\")))","v":"N/A"}]
{"$rows_left_out":35}
{"sheet":"B (Acute-Optional)","index":2,"n_rows":11,"n_cols":7,"rows_kept":11,"cut":false,"hidden":false,"merged":[[0,0,1,0],[0,1,0,3]]}
["Toxicity Test Parameters","Water flea     ",null,null,"Fathead Minnow","Bluegill","Rainbow Trout"]
[null,"(Ceriodaphnia spp.)","(Daphnia spp.)","(Simocephalus spp.)","(Pimephales promelas)","(Lepomis macrochirus)","(Oncorhynchus mykiss)"]
["Temperature:"]
["Dilution water:"]
["Number of test concentrations:"]
["Dilution series setup:"]
["Number of organisms/test chamber:"]
["Number of replicate chambers per concentration:"]
["Number of organisms per concentration:"]
[]
{"$rows_left_out":2}
{"sheet":"C (Acute)","index":3,"n_rows":40,"n_cols":13,"rows_kept":40,"cut":false,"hidden":false,"merged":[[35,5,35,6],[36,5,36,6],[37,5,37,6],[29,8,31,8],[29,9,31,9],[29,10,31,10],[32,1,34,1],[32,2,34,2],[32,3,34,3],[32,5,34,5],[32,6,34,6],[32,7,34,7],[32,8,34,8],[32,9,34,9],[32,10,34,10],[26,9,28,9],[26,10,28,10],[29,0,34,0],[29,1,31,1],[29,2,31,2],[29,3,31,3],[29,5,31,5],[29,6,31,6],[29,7,31,7],[23,0,28,0],[23,7,25,7],[23,8,25,8],[23,9,25,9],[23,10,25,10],[26,1,28,1],[26,2,28,2],[23,1,25,1],[23,2,25,2],[23,3,25,3],[23,5,25,5],[23,6,25,6],[26,8,28,8],[17,9,22,9],[17,10,22,10],[20,2,22,2],[20,3,22,3],[20,5,22,5],[17,7,22,7],[17,2,19,2],[17,3,19,3],[17,5,19,5],[17,6,22,6],[17,8,22,8],[26,3,28,3],[26,5,28,5],[26,6,28,6],[26,7,28,7],[11,7,16,7],[11,8,16,8],[11,9,16,9],[11,10,16,10],[14,2,16,2],[14,3,16,3],[14,5,16,5],[11,6,16,6],[0,7,0,10],[2,6,10,6],[2,7,10,7],[2,8,10,8],[2,9,10,9],[2,10,10,10],[17,1,22,1],[0,0,1,0],[0,1,1,1],[0,2,1,2],[0,3,1,3],[38,5,39,6],[2,0,22,0],[2,1,10,1],[2,2,4,2],[2,3,4,3],[2,5,4,5],[5,2,7,2],[5,3,7,3],[5,5,7,5],[8,2,10,2],[8,3,10,3],[8,5,10,5],[11,1,16,1],[11,2,13,2],[11,3,13,3],[11,5,13,5],[0,11,1,11],[23,11,25,11],[14,11,16,11],[11,11,13,11],[8,11,10,11],[5,11,7,11],[2,11,4,11],[26,11,28,11],[29,11,31,11],[32,11,34,11],[20,11,22,11],[17,11,19,11]]}
["Taxa Category","Genus","Species","Common Name","Test Result","SMAV","GMAV","Designated Use Classification",null,null,null,"Used as sensitive species?"]
[null,null,null,null,"mg/L","mg/L","mg/L","CW","WW","LFF","LAL"]
["Planktonic Crustacean","Ceriodaphnia","dubia","Water flea",{"$f":"IF('A (Acute)'!L3=\"No\",\"N/A\",(IF('A (Acute)'!K3=\"\",\"\",'A (Acute)'!K3)))","v":""},{"$f":"IF(ISERROR(GEOMEAN(E3:E5)),\"N/A\",GEOMEAN(E3:E5))","v":"N/A"},{"$f":"IF(ISERROR(GEOMEAN(F3:F11)),\"N/A\",GEOMEAN(F3:F11))","v":"N/A"},"X","X","X","X",{"$f":"IF(AND(COUNT('C (Acute)'!$F$3:$F$35)>1,'C (Acute)'!F3=MIN('C (Acute)'!$F$3:$F$35)),\"Yes\",\"No\")","v":"No"}]
[null,null,null,null,{"$f":"IF('A (Acute)'!L4=\"No\",\"N/A\",(IF('A (Acute)'!K4=\"\",\"\",'A (Acute)'!K4)))","v":""}]
[null,null,null,null,{"$f":"IF('A (Acute)'!L5=\"No\",\"N/A\",(IF('A (Acute)'!K5=\"\",\"\",'A (Acute)'!K5)))","v":""}]
[null,null,"reticulata","Water flea",{"$f":"IF('A (Acute)'!L6=\"No\",\"N/A\",(IF('A (Acute)'!K6=\"\",\"\",'A (Acute)'!K6)))","v":""},{"$f":"IF(ISERROR(GEOMEAN(E6:E8)),\"N/A\",GEOMEAN(E6:E8))","v":"N/A"},null,null,null,null,null,{"$f":"IF(AND(COUNT('C (Acute)'!$F$3:$F$35)>1,'C (Acute)'!F6=MIN('C (Acute)'!$F$3:$F$35)),\"Yes\",\"No\")","v":"No"}]
[null,null,null,null,{"$f":"IF('A (Acute)'!L7=\"No\",\"N/A\",(IF('A (Acute)'!K7=\"\",\"\",'A (Acute)'!K7)))","v":""}]
[null,null,null,null,{"$f":"IF('A (Acute)'!L8=\"No\",\"N/A\",(IF('A (Acute)'!K8=\"\",\"\",'A (Acute)'!K8)))","v":""}]
[null,null,"serrulatus","Water flea",{"$f":"IF('A (Acute)'!L9=\"No\",\"N/A\",(IF('A (Acute)'!K9=\"\",\"\",'A (Acute)'!K9)))","v":""},{"$f":"IF(ISERROR(GEOMEAN(E9:E11)),\"N/A\",GEOMEAN(E9:E11))","v":"N/A"},null,null,null,null,null,{"$f":"IF(AND(COUNT('C (Acute)'!$F$3:$F$35)>1,'C (Acute)'!F9=MIN('C (Acute)'!$F$3:$F$35)),\"Yes\",\"No\")","v":"No"}]
[null,null,null,null,{"$f":"IF('A (Acute)'!L10=\"No\",\"N/A\",(IF('A (Acute)'!K10=\"\",\"\",'A (Acute)'!K10)))","v":""}]
{"$rows_left_out":31}
{"sheet":"SAF (2D)","index":4,"n_rows":11,"n_cols":4,"rows_kept":11,"cut":false,"hidden":true,"merged":[]}
["Taxa Requirements","Met?","Number of MDRs met","SAF"]
["Salmonid (e.g., rainbow trout, brook trout)",{"$f":"IF(AND('A (Acute)'!F30=\"\",'A (Acute)'!F31=\"\",'A (Acute)'!F32=\"\",'A (Acute)'!F33=\"\",'A (Acute)'!F34=\"\",'A (Acute)'!F35=\"\"),\"\",\"X\")","v":""},1,21.9]
["Non-salmonid fish (e.g., bluegill, fathead minnow)",{"$f":"IF(AND('A (Acute)'!F24=\"\",'A (Acute)'!F25=\"\",'A (Acute)'!F26=\"\",'A (Acute)'!F27=\"\",'A (Acute)'!F28=\"\",'A (Acute)'!F29=\"\"),\"\",\"X\")","v":""},2,13]
["Planktonic crustacean (Ceriodaphnia, Daphnia, Simocephalus spp.)",{"$f":"IF(AND('A (Acute)'!F3=\"\",'A (Acute)'!F4=\"\",'A (Acute)'!F5=\"\",'A (Acute)'!F6=\"\",'A (Acute)'!F7=\"\",'A (Acute)'!F8=\"\",'A (Acute)'!F9=\"\",'A (Acute)'!F10=\"\",'A (Acute)'!F11=\"\",'A (Acute)'!F12=\"\",'A (Acute)'!F13=\"\",'A (Acute)'!F14=\"\",'A (Acute)'!F15=\"\",'A (Acute)'!F16=\"\",'A (Acute)'!F17=\"\",'A (Acute)'!F18=\"\",'A (Acute)'!F19=\"\",'A (Acute)'!F20=\"\",'A (Acute)'!F21=\"\",'A (Acute)'!F22=\"\",'A (Acute)'!F23=\"\"),\"\",\"X\")","v":""},3,8]
["Benthic crustacean",null,4,7]
["Insect",null,5,6.1]
["Fish/amphibian in a family in the phylum Chordata",null,6,5.2]
["Organism in the a Phylum other than Arthropoda or Chordata",null,7,4.3]
["Organism in a family/phylum not already represented"]
["Number of MDRS Met:",{"$f":"COUNTIF(B2:B9,\"X\")","v":0}]
{"$rows_left_out":2}
{"sheet":"Acute-acceptiblity requirements","index":5,"n_rows":47,"n_cols":7,"rows_kept":47,"cut":false,"hidden":true,"merged":[[0,3,1,3],[0,1,1,1],[0,0,1,0],[25,0,26,0],[23,0,24,0],[21,0,22,0],[19,0,20,0],[17,0,18,0],[12,0,16,0],[9,0,11,0],[6,0,7,0],[2,0,4,0]]}
["Test Parameters","All species","Cladocerans","All Fish","Fathead Minnow","Bluegill","Rainbow Trout"]
[null,null,"(Ceriodaphnia, Daphnia, Simocephalus spp.)",null,"(Pimephales promelas)","(Lepomis macrochirus)","(Oncorhynchus mykiss)"]
["Exposure Format:","Static"]
[null,"Flow-through"]
[null,"Approved by DNR Toxicologist"]
[]
["Control response:","≥ 90% survival"]
[null,"Other"]
[null,"Approved by DNR Toxicologist"]
["Temperature:",null,"20±1 °C",null,"20±1 °C","20±1 °C","12 ± 1 °C"]
{"$rows_left_out":38}
{"sheet":"D (Chronic)","index":6,"n_rows":44,"n_cols":13,"rows_kept":44,"cut":false,"hidden":false,"merged":[[23,3,25,3],[2,3,4,3],[0,6,0,7],[0,5,1,5],[0,4,1,4],[5,3,7,3],[17,3,19,3],[8,3,10,3],[14,3,16,3],[20,3,22,3],[11,3,13,3],[23,0,34,0],[17,2,19,2],[8,2,10,2],[5,2,7,2],[2,2,4,2],[26,1,28,1],[20,2,22,2],[11,2,13,2],[14,2,16,2],[29,1,31,1],[29,2,31,2],[23,1,25,1],[23,2,25,2],[29,3,31,3],[32,1,34,1],[32,2,34,2],[32,3,34,3],[26,2,28,2],[26,3,28,3],[0,1,1,1],[0,0,1,0],[0,8,1,8],[0,2,1,2],[2,0,22,0],[20,1,22,1],[17,1,19,1],[14,1,16,1],[11,1,13,1],[8,1,10,1],[5,1,7,1],[2,1,4,1],[0,9,1,9],[0,3,1,3],[0,10,1,10],[0,12,1,12],[0,11,1,11]]}
["Taxa Category","Genus","Species","Common Name","Test Type","Test Endpoint","Toxicity Test Result",null,"Test Method","Exposure Format","Control Response","Toxicity Value (mg/L)","Acceptable?"]
[null,null,null,null,null,null,"Value","Units"]
["Invertebrate","Ceriodaphnia","dubia","Water flea",null,null,null,null,null,null,null,{"$f":"IF(M3=\"No\",\"\",IF(H3=\"mg/L (ppm)\",G3,(IF(H3=\"µg/L (ppb)\",G3/1000,(IF(H3=\"g/L\",G3*1000,\"\"))))))","v":""},{"$f":"IF(AND(E3=\"\",F3=\"\",H3=\"\",I3=\"\",J3=\"\",K3=\"\"),\"N/A\",(IF(OR(E3=\"\",E3=\"Other\",F3=\"Other\",F3=\"\",(AND(I3=\"Other\",'E (Chronic-Optional)'!$B$12=\"No\")),I3=\"\",J3=\"Other\",J3=\"\",K3=\"Other\",K3=\"\"),\"No\",\"Yes\")))","v":"N/A"}]
[null,null,null,null,null,null,null,null,null,null,null,"",{"$f":"IF(AND(E4=\"\",F4=\"\",H4=\"\",I4=\"\",J4=\"\",K4=\"\"),\"N/A\",(IF(OR(E4=\"\",E4=\"Other\",F4=\"Other\",F4=\"\",(AND(I4=\"Other\",'E (Chronic-Optional)'!$B$12=\"No\")),I4=\"\",J4=\"Other\",J4=\"\",K4=\"Other\",K4=\"\"),\"No\",\"Yes\")))","v":"N/A"}]
[null,null,null,null,null,null,null,null,null,null,null,"",{"$f":"IF(AND(E5=\"\",F5=\"\",H5=\"\",I5=\"\",J5=\"\",K5=\"\"),\"N/A\",(IF(OR(E5=\"\",E5=\"Other\",F5=\"Other\",F5=\"\",(AND(I5=\"Other\",'E (Chronic-Optional)'!$B$12=\"No\")),I5=\"\",J5=\"Other\",J5=\"\",K5=\"Other\",K5=\"\"),\"No\",\"Yes\")))","v":"N/A"}]
[null,"Ceriodaphnia","reticulata","Water flea",null,null,null,null,null,null,null,"",{"$f":"IF(AND(E6=\"\",F6=\"\",H6=\"\",I6=\"\",J6=\"\",K6=\"\"),\"N/A\",(IF(OR(E6=\"\",E6=\"Other\",F6=\"Other\",F6=\"\",(AND(I6=\"Other\",'E (Chronic-Optional)'!$B$12=\"No\")),I6=\"\",J6=\"Other\",J6=\"\",K6=\"Other\",K6=\"\"),\"No\",\"Yes\")))","v":"N/A"}]
[null,null,null,null,null,null,null,null,null,null,null,"",{"$f":"IF(AND(E7=\"\",F7=\"\",H7=\"\",I7=\"\",J7=\"\",K7=\"\"),\"N/A\",(IF(OR(E7=\"\",E7=\"Other\",F7=\"Other\",F7=\"\",(AND(I7=\"Other\",'E (Chronic-Optional)'!$B$12=\"No\")),I7=\"\",J7=\"Other\",J7=\"\",K7=\"Other\",K7=\"\"),\"No\",\"Yes\")))","v":"N/A"}]
[null,null,null,null,null,null,null,null,null,null,null,"",{"$f":"IF(AND(E8=\"\",F8=\"\",H8=\"\",I8=\"\",J8=\"\",K8=\"\"),\"N/A\",(IF(OR(E8=\"\",E8=\"Other\",F8=\"Other\",F8=\"\",(AND(I8=\"Other\",'E (Chronic-Optional)'!$B$12=\"No\")),I8=\"\",J8=\"Other\",J8=\"\",K8=\"Other\",K8=\"\"),\"No\",\"Yes\")))","v":"N/A"}]
[null,"Ceriodaphnia","serrulatus","Water flea",null,null,null,null,null,null,null,"",{"$f":"IF(AND(E9=\"\",F9=\"\",H9=\"\",I9=\"\",J9=\"\",K9=\"\"),\"N/A\",(IF(OR(E9=\"\",E9=\"Other\",F9=\"Other\",F9=\"\",(AND(I9=\"Other\",'E (Chronic-Optional)'!$B$12=\"No\")),I9=\"\",J9=\"Other\",J9=\"\",K9=\"Other\",K9=\"\"),\"No\",\"Yes\")))","v":"N/A"}]
[null,null,null,null,null,null,null,null,null,null,null,"",{"$f":"IF(AND(E10=\"\",F10=\"\",H10=\"\",I10=\"\",J10=\"\",K10=\"\"),\"N/A\",(IF(OR(E10=\"\",E10=\"Other\",F10=\"Other\",F10=\"\",(AND(I10=\"Other\",'E (Chronic-Optional)'!$B$12=\"No\")),I10=\"\",J10=\"Other\",J10=\"\",K10=\"Other\",K10=\"\"),\"No\",\"Yes\")))","v":"N/A"}]
{"$rows_left_out":35}
{"sheet":"E (Chronic-Optional)","index":7,"n_rows":12,"n_cols":5,"rows_kept":12,"cut":false,"hidden":false,"merged":[[0,0,1,0],[0,1,0,3]]}
["Toxicity Test Parameters","Water flea",null,null,"Fathead Minnow"]
[null,"(Ceriodaphnia spp.)","(Daphnia spp.)","(Simocephalus spp.)","(Pimephales promelas)"]
["Test duration:"]
["Temperature:"]
["Dilution water:"]
["Number of test concentrations:"]
["Dilution series setup:"]
["Number of organisms/test chamber:"]
["Number of replicate chambers per concentration:"]
["Number of organisms per concentration:"]
{"$rows_left_out":3}
{"sheet":"F (Chronic)","index":8,"n_rows":77,"n_cols":13,"rows_kept":77,"cut":false,"hidden":false,"merged":[[0,7,1,7],[0,6,1,6],[50,4,52,4],[53,4,55,4],[20,4,22,4],[17,4,19,4],[14,4,16,4],[11,4,13,4],[8,4,10,4],[44,4,46,4],[47,4,49,4],[27,4,29,4],[24,4,26,4],[5,4,7,4],[2,4,4,4],[41,4,43,4],[20,6,22,6],[44,7,46,7],[53,6,55,6],[27,11,29,11],[24,11,26,11],[2,8,4,8],[2,9,4,9],[2,10,4,10],[20,9,22,9],[20,10,22,10],[20,11,22,11],[11,8,13,8],[11,9,13,9],[11,10,13,10],[11,11,13,11],[14,8,16,8],[14,9,16,9],[14,10,16,10],[14,11,16,11],[17,8,19,8],[17,9,19,9],[17,11,19,11],[2,11,4,11],[5,8,7,8],[5,9,7,9],[5,11,7,11],[0,0,1,0],[0,1,1,1],[0,2,1,2],[0,3,1,3],[0,8,0,11],[2,7,4,7],[5,7,7,7],[5,2,7,2],[5,3,7,3],[2,0,22,0],[2,2,4,2],[2,3,4,3],[11,2,13,2],[11,3,13,3],[14,7,16,7],[11,7,13,7],[20,7,22,7],[17,7,19,7],[8,7,10,7],[8,11,10,11],[17,2,19,2],[17,3,19,3],[20,8,22,8],[8,2,10,2],[59,7,61,7],[59,8,61,8],[24,0,35,0],[27,3,29,3],[27,7,29,7],[27,8,29,8],[24,1,26,1],[24,2,26,2],[24,3,26,3],[24,7,26,7],[30,8,32,8],[24,8,26,8],[33,4,35,4],[30,7,32,7],[27,1,29,1],[24,6,26,6],[27,6,29,6],[30,4,32,4],[56,7,58,7],[56,8,58,8],[53,1,55,1],[53,2,55,2],[53,3,55,3],[38,0,70,0],[38,11,40,11],[41,11,43,11],[44,10,46,10],[44,11,46,11],[47,1,49,1],[47,2,49,2],[62,7,64,7],[62,8,64,8],[62,9,64,9],[53,7,55,7],[53,8,55,8],[53,9,55,9],[53,10,55,10],[47,3,49,3],[50,8,52,8],[44,8,46,8],[56,4,58,4],[59,9,61,9],[59,10,61,10],[59,11,61,11],[56,11,58,11],[50,11,52,11],[53,11,55,11],[47,11,49,11],[30,11,32,11],[33,1,35,1],[33,2,35,2],[33,3,35,3],[33,7,35,7],[33,8,35,8],[33,9,35,9],[33,10,35,10],[33,11,35,11],[30,6,32,6],[33,6,35,6],[30,9,32,9],[30,10,32,10],[8,3,10,3],[17,10,19,10],[5,10,7,10],[2,6,4,6],[5,6,7,6],[8,6,10,6],[11,6,13,6],[14,6,16,6],[17,6,19,6],[8,8,10,8],[8,9,10,9],[8,10,10,10],[14,3,16,3],[2,1,4,1],[5,1,7,1],[8,1,10,1],[11,1,13,1],[14,1,16,1],[17,1,19,1],[30,1,32,1],[30,2,32,2],[14,2,16,2],[20,2,22,2],[56,9,58,9],[56,10,58,10],[50,9,52,9],[44,9,46,9],[47,9,49,9],[47,10,49,10],[38,7,40,7],[38,8,40,8],[38,9,40,9],[38,10,40,10],[41,7,43,7],[41,8,43,8],[41,9,43,9],[41,10,43,10],[47,7,49,7],[20,3,22,3],[38,1,40,1],[38,2,40,2],[38,3,40,3],[27,2,29,2],[20,1,22,1],[30,3,32,3],[50,10,52,10],[27,10,29,10],[24,9,26,9],[24,10,26,10],[27,9,29,9],[47,8,49,8],[50,1,52,1],[50,2,52,2],[50,3,52,3],[50,7,52,7],[38,6,40,6],[41,6,43,6],[44,6,46,6],[47,6,49,6],[50,6,52,6],[62,11,64,11],[65,1,67,1],[65,2,67,2],[65,3,67,3],[65,4,67,4],[65,7,67,7],[65,8,67,8],[65,9,67,9],[65,10,67,10],[65,11,67,11],[62,1,64,1],[62,2,64,2],[62,3,64,3],[62,4,64,4],[62,10,64,10],[65,6,67,6],[75,6,76,7],[68,11,70,11],[68,1,70,1],[68,2,70,2],[68,3,70,3],[68,4,70,4],[68,7,70,7],[68,8,70,8],[68,9,70,9],[68,10,70,10],[72,6,72,7],[73,6,73,7],[74,6,74,7],[68,6,70,6],[56,6,58,6],[59,6,61,6],[62,6,64,6],[41,1,43,1],[41,2,43,2],[41,3,43,3],[38,4,40,4],[59,4,61,4],[59,1,61,1],[59,2,61,2],[59,3,61,3],[44,3,46,3],[44,1,46,1],[44,2,46,2],[56,1,58,1],[56,2,58,2],[56,3,58,3]]}
["Taxa Category","Genus","Species","Common Name","SMAV","Chronic Test Value","SMCV","SMACR","Designated Use Classification"]
[null,null,null,null,"mg/L","mg/L",null,null,"CW","WW","LFF","LAL"]
["Invertebrate",{"$f":"'D (Chronic)'!B3","v":"Ceriodaphnia"},{"$f":"'D (Chronic)'!C3","v":"dubia"},"Water flea",{"$f":"IF(AND('A (Acute)'!K3=\"\",'A (Acute)'!K4=\"\",'A (Acute)'!K5=\"\"),\"\",GEOMEAN('A (Acute)'!K3:K5))","v":""},{"$f":"IF('C (Acute)'!L3=\"No\",'D (Chronic)'!L3,(IF('C (Acute)'!L3=\"Yes\",\"used in sensitive spp SMACR\")))","v":""},{"$f":"IFERROR(GEOMEAN(F3:F5),\"\")","v":""},{"$f":"IFERROR(GEOMEAN(E3/G3),\"\")","v":""},{"$f":"IF($B3=\"N/A\",\"\",\"X\")","v":"X"},{"$f":"IF($B3=\"N/A\",\"\",\"X\")","v":"X"},"X","X"]
[null,null,null,null,null,{"$f":"IF('C (Acute)'!L3=\"No\",'D (Chronic)'!L4,(IF('C (Acute)'!L3=\"Yes\",\"used in sensitive spp SMACR\")))","v":""}]
[null,null,null,null,null,{"$f":"IF('C (Acute)'!L3=\"No\",'D (Chronic)'!L5,(IF('C (Acute)'!L3=\"Yes\",\"used in sensitive spp SMACR\")))","v":""}]
[null,{"$f":"'D (Chronic)'!B6","v":"Ceriodaphnia"},{"$f":"'D (Chronic)'!C6","v":"reticulata"},"Water flea",{"$f":"IF(AND('A (Acute)'!K6=\"\",'A (Acute)'!K7=\"\",'A (Acute)'!K8=\"\"),\"\",GEOMEAN('A (Acute)'!K6:K8))","v":""},{"$f":"IF('C (Acute)'!L6=\"No\",'D (Chronic)'!L6,(IF('C (Acute)'!L6=\"Yes\",\"used in sensitive spp SMACR\")))","v":""},{"$f":"IFERROR(GEOMEAN(F6:F8),\"\")","v":""},{"$f":"IFERROR(GEOMEAN(E6/G6),\"\")","v":""},{"$f":"IF($B6=\"N/A\",\"\",\"X\")","v":"X"},"X","X","X"]
[null,null,null,null,null,{"$f":"IF('C (Acute)'!L6=\"No\",'D (Chronic)'!L7,(IF('C (Acute)'!L6=\"Yes\",\"used in sensitive spp SMACR\")))","v":""}]
[null,null,null,null,null,{"$f":"IF('C (Acute)'!L6=\"No\",'D (Chronic)'!L8,(IF('C (Acute)'!L6=\"Yes\",\"used in sensitive spp SMACR\")))","v":""}]
[null,{"$f":"'D (Chronic)'!B9","v":"Ceriodaphnia"},{"$f":"'D (Chronic)'!C9","v":"serrulatus"},"Water flea",{"$f":"IF(AND('A (Acute)'!K9=\"\",'A (Acute)'!K10=\"\",'A (Acute)'!K11=\"\"),\"\",GEOMEAN('A (Acute)'!K9:K11))","v":""},{"$f":"IF('C (Acute)'!L9=\"No\",'D (Chronic)'!L9,(IF('C (Acute)'!L9=\"Yes\",\"used in sensitive spp SMACR\")))","v":""},{"$f":"IFERROR(GEOMEAN(F9:F11),\"\")","v":""},{"$f":"IFERROR(GEOMEAN(E9/G9),\"\")","v":""},{"$f":"IF($B9=\"N/A\",\"\",\"X\")","v":"X"},"X","X","X"]
[null,null,null,null,null,{"$f":"IF('C (Acute)'!L9=\"No\",'D (Chronic)'!L10,(IF('C (Acute)'!L9=\"Yes\",\"used in sensitive spp SMACR\")))","v":""}]
{"$rows_left_out":68}
{"sheet":"Chronic-acceptiblity requiremen","index":9,"n_rows":54,"n_cols":4,"rows_kept":54,"cut":false,"hidden":true,"merged":[[1,0,3,0],[29,0,30,0],[18,0,19,0],[7,0,9,0],[5,0,6,0],[13,0,17,0],[10,0,12,0],[27,0,28,0],[22,0,23,0],[20,0,21,0],[24,0,26,0]]}
["Test Parameter","All species","Cladoceran/water flea (Ceriodaphnia dubia)","Fathead minnow (Pimephales promelas)"]
["Exposure Format:","Static"]
[null,"Flow-through"]
[null,"Approved by DNR Toxicologist"]
[]
["Test duration:",null,"≤ 8 days","7 days"]
[null,null,"Other","other"]
["Control response:","≥80% survival"]
[null,"Approved by DNR Toxicologist","≥80% survival, average of ≥15  young per surviving control female, and 80% of surviving control females must produce 3 broods  (recommended)","≥80% survival and average dry weight per organism of control ≥ 0.25 mg  (recommended for 1001.0)"]
[null,null,"Other","Other"]
{"$rows_left_out":45}
{"sheet":"Tab Descriptions","index":10,"n_rows":8,"n_cols":4,"rows_kept":8,"cut":false,"hidden":true,"merged":[[1,1,4,1],[5,1,7,1]]}
["Tab","Value Category","Description","Steps"]
["A","Acute","Available Data","1-3"]
["B",null,"Data Acceptability","2A"]
["C",null,"SAV Calculation","4-9"]
["D",null,"Taxa Requirements",7]
["E","Chronic","Available Data","1-3"]
["F",null,"Data Acceptability","2A"]
["G",null,"SCV Calculation","4-9"]